Target
Bromodomain-containing protein 4 [42-168]
Ligand
BDBM321358
Substrate
Meas. Tech.
IC50 Measurements for Inhibitors Using BRD4 AlphaLisa Binding Assay
IC50
720±n/a nM
Citation
 Albrecht, BKBellon, SFBurdick, DJCote, ACrawford, TDakin, LAHsiao-Wei Tsui, VHewitt, MCLeBlanc, YMagnuson, SRNasveschuk, CGRomero, FATang, YTaylor, AMWang, S Therapeutic compounds and uses thereof US Patent  US10183009 Publication Date 1/22/2019 
Target
Name:
Bromodomain-containing protein 4 [42-168]
Synonyms:
BRD4 BRD4_HUMAN HUNK1
Type:
Enzyme Catalytic Domain
Mol. Mass.:
15054.68
Organism:
Homo sapiens (Human)
Description:
O60885[42-168]
Residue:
127
  
Inhibitor
Name:
BDBM321358
Synonyms:
3-(6-but-2-enyl-7-oxo-1H-pyrrolo[2,3-c]pyridin-4-yl)-N-isopropyl-benzamide | US10183009, Example 35
Type:
Small organic molecule
Emp. Form.:
C21H23N3O2
Mol. Mass.:
349.4262
SMILES:
CC=CCn1cc(-c2cccc(c2)C(=O)NC(C)C)c2cc[nH]c2c1=O
: