Target
Bromodomain-containing protein 9 [134-239]
Ligand
BDBM321379
Substrate
Meas. Tech.
IC50 measurements for inhibitors using BRD9 AlphaLisa Binding Assay
IC50
510±n/a nM
Citation
 Albrecht, BKBellon, SFBurdick, DJCote, ACrawford, TDakin, LAHsiao-Wei Tsui, VHewitt, MCLeBlanc, YMagnuson, SRNasveschuk, CGRomero, FATang, YTaylor, AMWang, S Therapeutic compounds and uses thereof US Patent  US10183009 Publication Date 1/22/2019 
Target
Name:
Bromodomain-containing protein 9 [134-239]
Synonyms:
BRD9 BRD9_HUMAN
Type:
Enzyme Catalytic Domain
Mol. Mass.:
12286.22
Organism:
Homo sapiens (Human)
Description:
Q9H8M2[134-239]
Residue:
106
  
Inhibitor
Name:
BDBM321379
Synonyms:
3-(6-but-2-enyl-7-oxo-1H-pyrrolo[2,3-c]pyridin-4-yl)benzamide | US10183009, Example 30
Type:
Small organic molecule
Emp. Form.:
C18H17N3O2
Mol. Mass.:
307.3465
SMILES:
CC=CCn1cc(-c2cccc(c2)C(N)=O)c2cc[nH]c2c1=O
: