Target
Bromodomain-containing protein 9 [134-239]
Ligand
BDBM321399
Substrate
Meas. Tech.
IC50 measurements for inhibitors using BRD9 AlphaLisa Binding Assay
IC50
65.0±n/a nM
Citation
 Albrecht, BKBellon, SFBurdick, DJCote, ACrawford, TDakin, LAHsiao-Wei Tsui, VHewitt, MCLeBlanc, YMagnuson, SRNasveschuk, CGRomero, FATang, YTaylor, AMWang, S Therapeutic compounds and uses thereof US Patent  US10183009 Publication Date 1/22/2019 
Target
Name:
Bromodomain-containing protein 9 [134-239]
Synonyms:
BRD9 BRD9_HUMAN
Type:
Enzyme Catalytic Domain
Mol. Mass.:
12286.22
Organism:
Homo sapiens (Human)
Description:
Q9H8M2[134-239]
Residue:
106
  
Inhibitor
Name:
BDBM321399
Synonyms:
4-[5-(6-acetyl-2,6-diazaspiro[3.3]heptane-2-carbonyl)-2-methoxy-phenyl]-6-butyl-1H-pyrrolo[2,3-c]pyridin-7-one | US10183009, Example 78
Type:
Small organic molecule
Emp. Form.:
C26H30N4O4
Mol. Mass.:
462.5408
SMILES:
CCCCn1cc(-c2cc(ccc2OC)C(=O)N2CC3(CN(C3)C(C)=O)C2)c2cc[nH]c2c1=O
: