Target
Bromodomain-containing protein 9 [134-239]
Ligand
BDBM321423
Substrate
Meas. Tech.
IC50 measurements for inhibitors using BRD9 AlphaLisa Binding Assay
IC50
100.0±n/a nM
Citation
 Albrecht, BKBellon, SFBurdick, DJCote, ACrawford, TDakin, LAHsiao-Wei Tsui, VHewitt, MCLeBlanc, YMagnuson, SRNasveschuk, CGRomero, FATang, YTaylor, AMWang, S Therapeutic compounds and uses thereof US Patent  US10183009 Publication Date 1/22/2019 
Target
Name:
Bromodomain-containing protein 9 [134-239]
Synonyms:
BRD9 BRD9_HUMAN
Type:
Enzyme Catalytic Domain
Mol. Mass.:
12286.22
Organism:
Homo sapiens (Human)
Description:
Q9H8M2[134-239]
Residue:
106
  
Inhibitor
Name:
BDBM321423
Synonyms:
6-[(E)-but-2-enyl]-4-[4-(1-hydroxy-1-methyl-ethyl)-2-methoxy-phenyl]-2-methyl-1H-pyrrolo[2,3-c]pyridin-7-one | US10183009, Example 107
Type:
Small organic molecule
Emp. Form.:
C22H26N2O3
Mol. Mass.:
366.4534
SMILES:
COc1cc(ccc1-c1cn(C\C=C\C)c(=O)c2[nH]c(C)cc12)C(C)(C)O
: