Target
Bromodomain-containing protein 9 [134-239]
Ligand
BDBM321436
Substrate
Meas. Tech.
IC50 measurements for inhibitors using BRD9 AlphaLisa Binding Assay
IC50
9.00±n/a nM
Citation
 Albrecht, BKBellon, SFBurdick, DJCote, ACrawford, TDakin, LAHsiao-Wei Tsui, VHewitt, MCLeBlanc, YMagnuson, SRNasveschuk, CGRomero, FATang, YTaylor, AMWang, S Therapeutic compounds and uses thereof US Patent  US10183009 Publication Date 1/22/2019 
Target
Name:
Bromodomain-containing protein 9 [134-239]
Synonyms:
BRD9 BRD9_HUMAN
Type:
Enzyme Catalytic Domain
Mol. Mass.:
12286.22
Organism:
Homo sapiens (Human)
Description:
Q9H8M2[134-239]
Residue:
106
  
Inhibitor
Name:
BDBM321436
Synonyms:
4-[4-[3-(3-aminopyrazol-1-yl)azetidine-1-carbonyl]phenyl]-6-[(E)-but-2-enyl]-2-methyl-1H-pyrrolo[2,3-c]pyridin-7-one | US10183009, Example 118
Type:
Small organic molecule
Emp. Form.:
C25H26N6O2
Mol. Mass.:
442.5129
SMILES:
C\C=C\Cn1cc(-c2ccc(cc2)C(=O)N2CC(C2)n2ccc(N)n2)c2cc(C)[nH]c2c1=O
: