Target
Chromatin remodeling regulator CECR2 [424-538]
Ligand
BDBM321448
Substrate
Meas. Tech.
IC50 Measurements for Inhibitors Using TAF1-BD2 TR-FRET Binding Assay
IC50
110±n/a nM
Citation
 Albrecht, BKBellon, SFBurdick, DJCote, ACrawford, TDakin, LAHsiao-Wei Tsui, VHewitt, MCLeBlanc, YMagnuson, SRNasveschuk, CGRomero, FATang, YTaylor, AMWang, S Therapeutic compounds and uses thereof US Patent  US10183009 Publication Date 1/22/2019 
Target
Name:
Chromatin remodeling regulator CECR2 [424-538]
Synonyms:
CECR2 CECR2_HUMAN KIAA1740
Type:
Enzyme Catalytic Domain
Mol. Mass.:
13747.10
Organism:
Homo sapiens (Human)
Description:
Q9BXF3[424-538]
Residue:
115
  
Inhibitor
Name:
BDBM321448
Synonyms:
3-(6-but-3-enyl-7-oxo-1H-pyrrolo[2,3-c]pyridin-4-yl)-N,N-dimethyl-benzamide | US10183009, Example 8
Type:
Small organic molecule
Emp. Form.:
C20H21N3O2
Mol. Mass.:
335.3996
SMILES:
CN(C)C(=O)c1cccc(c1)-c1cn(CCC=C)c(=O)c2[nH]ccc12
: