Target
Guanylate cyclase soluble subunit alpha-1
Ligand
BDBM321686
Substrate
Meas. Tech.
sGC-HEK-cGMP Assay
EC50
>1000±n/a nM
Citation
 Nakai, TJia, JRenhowe, PABarden, TCYu, XYSheppeck, JEIyer, KJung, JMilne, GTLong, KKCurrie, MGMoore, JPerl, NRIyengar, RRMermerian, AIm, GJLee, TWHudson, CRennie, GR sGC stimulators US Patent  US10183021 Publication Date 1/22/2019 
Target
Name:
Guanylate cyclase soluble subunit alpha-1
Synonyms:
GCS-alpha-1 GCYA1_HUMAN GUCSA3 GUCY1A3 Guanylate cyclase soluble subunit alpha-3 Solube guanylate cyclase alpha-1 (sGCalpha) | soluble guanylate cyclase alpha-1 (sGC)
Type:
Enzyme
Mol. Mass.:
77457.21
Organism:
Homo sapiens (Human)
Description:
Q02108
Residue:
690
  
Inhibitor
Name:
BDBM321686
Synonyms:
US10183021, Compound I-506
Type:
Small organic molecule
Emp. Form.:
C22H18F2N6O2
Mol. Mass.:
436.4141
SMILES:
Fc1ccccc1Cn1nc(cc1-c1ccon1)-c1ncc(F)c(n1)N1CCCCC1=O
: