Target
Ectonucleotide pyrophosphatase/phosphodiesterase family member 2
Ligand
BDBM321890
Substrate
Meas. Tech.
ATX Assay
IC50
8.50±n/a nM
Citation
 Beattie, DBaettig, ULe Grand, DMLister, ASMcKenna, JPearce, DWSandham, DASteward, ORThomson, C Autotaxin inhibitors US Patent  US10183025 Publication Date 1/22/2019 
Target
Name:
Ectonucleotide pyrophosphatase/phosphodiesterase family member 2
Synonyms:
ATX Autotaxin (ATX) ENPP2 Ectonucleotide Pyrophosphatase/Phosphodiesterase 2 (ENPP2) Extracellular lysophospholipase D PDNP2
Type:
Enzyme
Mol. Mass.:
99007.13
Organism:
Homo sapiens (Human)
Description:
Q13822
Residue:
863
  
Inhibitor
Name:
BDBM321890
Synonyms:
(E)-3-(4-Chloro-2-((5-methyl-2H-tetrazol-2-yl)methyl)phenyl)-1-(4-(4-methyl-2H-1,2,3-triazol-2-yl)piperidin-1-yl)prop-2-en-1-one US9763957, Example 25
Type:
Small organic molecule
Emp. Form.:
C20H23ClN8O
Mol. Mass.:
426.903
SMILES:
Cc1cnn(n1)C1CCN(CC1)C(=O)\C=C\c1ccc(Cl)cc1Cn1nnc(C)n1
: