Target
Ectonucleotide pyrophosphatase/phosphodiesterase family member 2
Ligand
BDBM321933
Substrate
Meas. Tech.
ATX Assay
IC50
127±n/a nM
Citation
 Beattie, DBaettig, ULe Grand, DMLister, ASMcKenna, JPearce, DWSandham, DASteward, ORThomson, C Autotaxin inhibitors US Patent  US10183025 Publication Date 1/22/2019 
Target
Name:
Ectonucleotide pyrophosphatase/phosphodiesterase family member 2
Synonyms:
ATX Autotaxin (ATX) ENPP2 Ectonucleotide Pyrophosphatase/Phosphodiesterase 2 (ENPP2) Extracellular lysophospholipase D PDNP2
Type:
Enzyme
Mol. Mass.:
99007.13
Organism:
Homo sapiens (Human)
Description:
Q13822
Residue:
863
  
Inhibitor
Name:
BDBM321933
Synonyms:
(E)-1-(3-Acetylpiperidin-1-yl)-3-(4-chloro-2-((5-methyl-2H-tetrazol-2-yl)methyl)phenyl)prop-2-en-1-one US9763957, Example 49.15
Type:
Small organic molecule
Emp. Form.:
C19H22ClN5O2
Mol. Mass.:
387.863
SMILES:
CC(=O)C1CCCN(C1)C(=O)\C=C\c1ccc(Cl)cc1Cn1nnc(C)n1
: