Target
Ectonucleotide pyrophosphatase/phosphodiesterase family member 2
Ligand
BDBM322063
Substrate
Meas. Tech.
ATX Assay
IC50
3.10±n/a nM
Citation
 Beattie, DBaettig, ULe Grand, DMLister, ASMcKenna, JPearce, DWSandham, DASteward, ORThomson, C Autotaxin inhibitors US Patent  US10183025 Publication Date 1/22/2019 
Target
Name:
Ectonucleotide pyrophosphatase/phosphodiesterase family member 2
Synonyms:
ATX Autotaxin (ATX) ENPP2 Ectonucleotide Pyrophosphatase/Phosphodiesterase 2 (ENPP2) Extracellular lysophospholipase D PDNP2
Type:
Enzyme
Mol. Mass.:
99007.13
Organism:
Homo sapiens (Human)
Description:
Q13822
Residue:
863
  
Inhibitor
Name:
BDBM322063
Synonyms:
(E)-N-(1-(3-(4-Chloro-2-((5-methyl-2H-tetrazol-2-yl)methyl)phenyl)acryloyl)piperidin-4-yl)-4-(1H-1,2,3-triazol-4-yl)butanamide US9763957, Example 151
Type:
Small organic molecule
Emp. Form.:
C23H28ClN9O2
Mol. Mass.:
497.981
SMILES:
Cc1nnn(Cc2cc(Cl)ccc2\C=C\C(=O)N2CCC(CC2)NC(=O)CCCc2c[nH]nn2)n1
: