Target
5-hydroxytryptamine receptor 2C
Ligand
BDBM322084
Substrate
Meas. Tech.
5-HT2C Receptor Binding Assay
Ki
1.90±n/a nM
Citation
 Sasaki, IToyoda, TYoshinaga, HNatsutani, ITakahashi, Y Pyrazole compound US Patent  US10183913 Publication Date 1/22/2019 
Target
Name:
5-hydroxytryptamine receptor 2C
Synonyms:
5-HT-2C 5-HT2C-INI 5-HTR2C 5-hydroxytryptamine receptor 2C (5-HT-2C) 5HT-1C HTR1C Serotonin (5-HT3) receptor Serotonin Receptor 2C
Type:
G Protein-Coupled Receptor (GPCR)
Mol. Mass.:
51836.79
Organism:
Homo sapiens (Human)
Description:
P28335
Residue:
458
  
Inhibitor
Name:
BDBM322084
Synonyms:
1-{5-[(5-chloro-2-fluorobenzyl)oxy]-1-(cyclopentylmethyl)-1H-pyrazol-3-yl}-N-methylmethanamine US11312688, Example 148 | US11576897, Example 496
Type:
Small organic molecule
Emp. Form.:
C18H23ClFN3O
Mol. Mass.:
351.846
SMILES:
CNCc1cc(OCc2cc(Cl)ccc2F)n(CC2CCCC2)n1
: