Target
5-hydroxytryptamine receptor 2C
Ligand
BDBM322085
Substrate
Meas. Tech.
5-HT2C Receptor Binding Assay
Ki
14.0±n/a nM
Citation
 Sasaki, IToyoda, TYoshinaga, HNatsutani, ITakahashi, Y Pyrazole compound US Patent  US10183913 Publication Date 1/22/2019 
Target
Name:
5-hydroxytryptamine receptor 2C
Synonyms:
5-HT-1C 5-HT1C 5-HT2C-INI 5-HTR2C 5-hydroxytryptamine receptor 2C (5-HT-2C) 5HT-1C HTR1C Serotonin (5-HT3) receptor Serotonin Receptor 2C
Type:
G Protein-Coupled Receptor (GPCR)
Mol. Mass.:
51836.79
Organism:
Homo sapiens (Human)
Description:
P28335
Residue:
458
  
Inhibitor
Name:
BDBM322085
Synonyms:
US10183913, Example 162 | US11576897, Example 162
Type:
Small organic molecule
Emp. Form.:
C19H24N4O
Mol. Mass.:
324.4201
SMILES:
CNCc1cc(OCc2ccccc2C#N)n(CC2CCCC2)n1
: