Target
Sodium-dependent serotonin transporter
Ligand
BDBM322102
Substrate
Meas. Tech.
h-SERT Binding Assay
Ki
5.50±n/a nM
Citation
 Sasaki, IToyoda, TYoshinaga, HNatsutani, ITakahashi, Y Pyrazole compound US Patent  US10183913 Publication Date 1/22/2019 
Target
Name:
Sodium-dependent serotonin transporter
Synonyms:
5-HT Transporter 5HTT SC6A4_HUMAN SLC6A4 Serotonin transporter (5HTT) Sodium-dependent serotonin transporter (SERT) | Solute carrier family 6 member 4
Type:
Multi-pass membrane protein
Mol. Mass.:
70322.51
Organism:
Homo sapiens (Human)
Description:
P31645
Residue:
630
  
Inhibitor
Name:
BDBM322102
Synonyms:
N-Methyl-1-{1-(4-methylbenzyl)-5-[(2,4,5-trifluorobenzyl)-oxy]-1H-pyrazol-3-yl}methanamine hydrochloride US11312688, Example 286 | US11576897, Example 286
Type:
Small organic molecule
Emp. Form.:
C20H20F3N3O
Mol. Mass.:
375.3875
SMILES:
CNCc1cc(OCc2cc(F)c(F)cc2F)n(Cc2ccc(C)cc2)n1
: