Target
Sodium-dependent serotonin transporter
Ligand
BDBM322106
Substrate
Meas. Tech.
h-SERT Binding Assay
Ki
0.960±n/a nM
Citation
 Sasaki, IToyoda, TYoshinaga, HNatsutani, ITakahashi, Y Pyrazole compound US Patent  US10183913 Publication Date 1/22/2019 
Target
Name:
Sodium-dependent serotonin transporter
Synonyms:
5-HT Transporter 5HTT SC6A4_HUMAN SLC6A4 Serotonin transporter (5HTT) Sodium-dependent serotonin transporter (SERT) | Solute carrier family 6 member 4
Type:
Multi-pass membrane protein
Mol. Mass.:
70322.51
Organism:
Homo sapiens (Human)
Description:
P31645
Residue:
630
  
Inhibitor
Name:
BDBM322106
Synonyms:
1-[5-(Benzyloxy)-1-(1-cyclohexyl-2-fluoroethyl)-1H-pyrazol-3-yl]-N-methylmethanamine hydrochloride US11312688, Example 330 | US11576897, Example 330
Type:
Small organic molecule
Emp. Form.:
C20H28FN3O
Mol. Mass.:
345.4542
SMILES:
CNCc1cc(OCc2ccccc2)n(n1)C(CF)C1CCCCC1
: