Target
5-hydroxytryptamine receptor 2C
Ligand
BDBM322106
Substrate
Meas. Tech.
5-HT2C Receptor Binding Assay
Ki
17.0±n/a nM
Citation
 Sasaki, IToyoda, TYoshinaga, HNatsutani, ITakahashi, Y Pyrazole compound US Patent  US10183913 Publication Date 1/22/2019 
Target
Name:
5-hydroxytryptamine receptor 2C
Synonyms:
5-HT-2C 5-HT2C-INI 5-HTR2C 5-hydroxytryptamine receptor 2C (5-HT-2C) 5HT-1C HTR1C Serotonin (5-HT3) receptor Serotonin Receptor 2C
Type:
G Protein-Coupled Receptor (GPCR)
Mol. Mass.:
51836.79
Organism:
Homo sapiens (Human)
Description:
P28335
Residue:
458
  
Inhibitor
Name:
BDBM322106
Synonyms:
1-[5-(Benzyloxy)-1-(1-cyclohexyl-2-fluoroethyl)-1H-pyrazol-3-yl]-N-methylmethanamine hydrochloride US11312688, Example 330 | US11576897, Example 330
Type:
Small organic molecule
Emp. Form.:
C20H28FN3O
Mol. Mass.:
345.4542
SMILES:
CNCc1cc(OCc2ccccc2)n(n1)C(CF)C1CCCCC1
: