Target
5-hydroxytryptamine receptor 2C
Ligand
BDBM322115
Substrate
Meas. Tech.
5-HT2C Receptor Binding Assay
Ki
17.0±n/a nM
Citation
 Sasaki, IToyoda, TYoshinaga, HNatsutani, ITakahashi, Y Pyrazole compound US Patent  US10183913 Publication Date 1/22/2019 
Target
Name:
5-hydroxytryptamine receptor 2C
Synonyms:
5-HT-2C 5-HT2C-INI 5-HTR2C 5-hydroxytryptamine receptor 2C (5-HT-2C) 5HT-1C HTR1C Serotonin (5-HT3) receptor Serotonin Receptor 2C
Type:
G Protein-Coupled Receptor (GPCR)
Mol. Mass.:
51836.79
Organism:
Homo sapiens (Human)
Description:
P28335
Residue:
458
  
Inhibitor
Name:
BDBM322115
Synonyms:
1-[1-Benzyl-5-(benzylsulfanyl)-1H-pyrazol-3-yl]-N-methylmethanamine hydrochloride | US10183913, Example 355
Type:
Small organic molecule
Emp. Form.:
C24H29N3O2S
Mol. Mass.:
423.571
SMILES:
CN(Cc1cc(SCc2ccccc2)n(Cc2ccccc2)n1)C(=O)OC(C)(C)C
: