Target
Rho-associated protein kinase 2
Ligand
BDBM322153
Substrate
Meas. Tech.
ROCK1 and ROCK2 Compound Selectivity
Ki
30.0±n/a nM
Citation
 Poyurovsky, MKim, JLiu, KZanin-Zhorov, A Rho kinase inhibitors US Patent  US10183931 Publication Date 1/22/2019 
Target
Name:
Rho-associated protein kinase 2
Synonyms:
KIAA0619 ROCK2 Rho kinase 2 (ROCKII) Rho-associated protein kinase 2 (ROCK2) Rho-associated protein kinase 2/Transforming protein RhoA Rho-associated, coiled-coil-containing protein kinase II p164 ROCK-2
Type:
Protein
Mol. Mass.:
160885.43
Organism:
Homo sapiens (Human)
Description:
O75116
Residue:
1388
  
Inhibitor
Name:
BDBM322153
Synonyms:
2-(3-(4-((1H-indazol-5-yl)amino)-5-methylpyrimidin-2-yl)phenoxy)-N-cyclopropylacetamide hydrochloride US10696660, Example 26 US9815820, ex. 26
Type:
Small organic molecule
Emp. Form.:
C23H22N6O2
Mol. Mass.:
414.4598
SMILES:
Cc1cnc(nc1Nc1ccc2[nH]ncc2c1)-c1cccc(OCC(=O)NC2CC2)c1
: