Target
Rho-associated protein kinase 2
Ligand
BDBM322155
Substrate
Meas. Tech.
ROCK1 and ROCK2 Compound Selectivity
Ki
40.0±n/a nM
Citation
 Poyurovsky, MKim, JLiu, KZanin-Zhorov, A Rho kinase inhibitors US Patent  US10183931 Publication Date 1/22/2019 
Target
Name:
Rho-associated protein kinase 2
Synonyms:
KIAA0619 ROCK2 Rho kinase 2 (ROCKII) Rho-associated protein kinase 2 (ROCK2) Rho-associated protein kinase 2/Transforming protein RhoA Rho-associated, coiled-coil-containing protein kinase II p164 ROCK-2
Type:
Protein
Mol. Mass.:
160885.43
Organism:
Homo sapiens (Human)
Description:
O75116
Residue:
1388
  
Inhibitor
Name:
BDBM322155
Synonyms:
US10183931, SLx-2119 US11311541, Example SLx-2119 | US9815820, SLx-2119
Type:
Small organic molecule
Emp. Form.:
C26H24N6O2
Mol. Mass.:
452.5078
SMILES:
CC(C)NC(=O)COc1cccc(c1)-c1nc(Nc2ccc3[nH]ncc3c2)c2ccccc2n1
: