Target
Rho-associated protein kinase 2
Ligand
BDBM322174
Substrate
Meas. Tech.
ROCK1 and ROCK2 Compound Selectivity
IC50
30.0±n/a nM
Citation
 Poyurovsky, MKim, JLiu, KZanin-Zhorov, A Rho kinase inhibitors US Patent  US10183931 Publication Date 1/22/2019 
Target
Name:
Rho-associated protein kinase 2
Synonyms:
KIAA0619 ROCK2 Rho kinase 2 (ROCKII) Rho-associated protein kinase 2 (ROCK2) Rho-associated protein kinase 2/Transforming protein RhoA Rho-associated, coiled-coil-containing protein kinase II p164 ROCK-2
Type:
Protein
Mol. Mass.:
160885.43
Organism:
Homo sapiens (Human)
Description:
O75116
Residue:
1388
  
Inhibitor
Name:
BDBM322174
Synonyms:
N-(3-(4-((1H-indazol-5-yl)amino)pyrimidin-2-yl)phenyl)morpholine-4-carboxamide HCl salt US10696660, Example 17 | US11311541, Example 17
Type:
Small organic molecule
Emp. Form.:
C22H21N7O2
Mol. Mass.:
415.4478
SMILES:
O=C(Nc1cccc(c1)-c1nccc(Nc2ccc3[nH]ncc3c2)n1)N1CCOCC1
: