Target
Rho-associated protein kinase 2
Ligand
BDBM322180
Substrate
Meas. Tech.
ROCK1 and ROCK2 Compound Selectivity
IC50
1000±n/a nM
Citation
 Poyurovsky, MKim, JLiu, KZanin-Zhorov, A Rho kinase inhibitors US Patent  US10183931 Publication Date 1/22/2019 
Target
Name:
Rho-associated protein kinase 2
Synonyms:
KIAA0619 ROCK2 Rho kinase 2 (ROCKII) Rho-associated protein kinase 2 (ROCK2) Rho-associated protein kinase 2/Transforming protein RhoA Rho-associated, coiled-coil-containing protein kinase II p164 ROCK-2
Type:
Protein
Mol. Mass.:
160885.43
Organism:
Homo sapiens (Human)
Description:
O75116
Residue:
1388
  
Inhibitor
Name:
BDBM322180
Synonyms:
N-(2-(4-(1-aminoethyl)phenyl)pyrimidin-4-yl)-1H-indazol-5-amine US10696660, Example 150 | US11311541, Example 150
Type:
Small organic molecule
Emp. Form.:
C19H18N6
Mol. Mass.:
330.3864
SMILES:
CC(N)c1ccc(cc1)-c1nccc(Nc2ccc3[nH]ncc3c2)n1
: