Target
Rho-associated protein kinase 2
Ligand
BDBM322181
Substrate
Meas. Tech.
ROCK1 and ROCK2 Compound Selectivity
IC50
310±n/a nM
Citation
 Poyurovsky, MKim, JLiu, KZanin-Zhorov, A Rho kinase inhibitors US Patent  US10183931 Publication Date 1/22/2019 
Target
Name:
Rho-associated protein kinase 2
Synonyms:
KIAA0619 ROCK2 Rho kinase 2 (ROCKII) Rho-associated protein kinase 2 (ROCK2) Rho-associated protein kinase 2/Transforming protein RhoA Rho-associated, coiled-coil-containing protein kinase II p164 ROCK-2
Type:
Protein
Mol. Mass.:
160885.43
Organism:
Homo sapiens (Human)
Description:
O75116
Residue:
1388
  
Inhibitor
Name:
BDBM322181
Synonyms:
US10183931, Example 179 US11311541, Example 179
Type:
Small organic molecule
Emp. Form.:
C23H22N6O2
Mol. Mass.:
414.4598
SMILES:
O=C(NC1CCOCC1)c1cccc(c1)-c1nccc(Nc2ccc3[nH]ncc3c2)n1
: