Target
Rho-associated protein kinase 2
Ligand
BDBM322186
Substrate
Meas. Tech.
ROCK1 and ROCK2 Compound Selectivity
IC50
3200±n/a nM
Citation
 Poyurovsky, MKim, JLiu, KZanin-Zhorov, A Rho kinase inhibitors US Patent  US10183931 Publication Date 1/22/2019 
Target
Name:
Rho-associated protein kinase 2
Synonyms:
KIAA0619 ROCK2 Rho kinase 2 (ROCKII) Rho-associated protein kinase 2 (ROCK2) Rho-associated protein kinase 2/Transforming protein RhoA Rho-associated, coiled-coil-containing protein kinase II p164 ROCK-2
Type:
Protein
Mol. Mass.:
160885.43
Organism:
Homo sapiens (Human)
Description:
O75116
Residue:
1388
  
Inhibitor
Name:
BDBM322186
Synonyms:
N-(6-(2-(dimethylamino)ethoxy)-2-(3-methoxyphenyl)pyrimidin-4-yl)-1H-indazol-5-amine US10696660, Example 161 | US11311541, Example 161
Type:
Small organic molecule
Emp. Form.:
C22H24N6O2
Mol. Mass.:
404.465
SMILES:
COc1cccc(c1)-c1nc(Nc2ccc3[nH]ncc3c2)cc(OCCN(C)C)n1
: