Target
Coagulation factor XI
Ligand
BDBM246246
Substrate
Meas. Tech.
Measurement of FXIa Inhibition
IC50
2.40±n/a nM
Citation
 Röhrig, SHillisch, AStrassburger, JHeitmeier, SSchmidt, MVSchlemmer, KTersteegen, ABuchmüller, AGerdes, CSchäfer, MKinzel, TTeller, HSchirok, HKlar, JNunez, EJ Substituted oxopyridine derivatives and use thereof cardiovascular disorders US Patent  US10183932 Publication Date 1/22/2019 
Target
Name:
Coagulation factor XI
Synonyms:
Coagulation factor XIa Coagulation factor XIa light chain FA11_HUMAN Factor XIa PTA | Plasma thromboplastin antecedent
Type:
Enzyme
Mol. Mass.:
70130.58
Organism:
Homo sapiens (Human)
Description:
P03951
Residue:
625
  
Inhibitor
Name:
BDBM246246
Synonyms:
US10183932, Example 154 US9434690, 153 US9822102, Example 154
Type:
Small organic molecule
Emp. Form.:
C30H30ClN3O6
Mol. Mass.:
564.029
SMILES:
CO[C@@H]1CC[C@H](CC(C(=O)Nc2ccc(cc2)C(O)=O)n2cc(OC)c(cc2=O)-c2cc(Cl)ccc2C#N)CC1
: