Target
P2X purinoceptor 3
Ligand
BDBM320016
Substrate
Meas. Tech.
Intracellular Calcium Measurement to Assess Antagonist Activity at Human P2X3 and Human P2X2/3 Receptors
IC50
2.00±n/a nM
Citation
 Davenport, AJBräuer, NFischer, OMRotgeri, ARottmann, ANeagoe, INagel, JGodinho-Coelho, AKlar, J 1,3-thiazol-2-yl substituted benzamides US Patent  US10183937 Publication Date 1/22/2019 
Target
Name:
P2X purinoceptor 3
Synonyms:
ATP receptor P2RX3 P2X purinoceptor 3 P2X purinoceptor 3 (P2X3) P2X3 purinoceptor p2x3 + hsa
Type:
Protein
Mol. Mass.:
44292.02
Organism:
Homo sapiens (Human)
Description:
P56373
Residue:
397
  
Inhibitor
Name:
BDBM320016
Synonyms:
Trans Isomer 1; 3- {[3-hydroxybutan- 2-yl]oxy}-5-(5- methyl-1,3- thiazol-2-yl)-N- {(1R)-1-[6- (trifluoromethyl) pyridazin-3- yl]ethyl}benzamide US10202369, Example 230 | US10472354, Example 231
Type:
Small organic molecule
Emp. Form.:
C22H23F3N4O3S
Mol. Mass.:
480.503
SMILES:
CC(O)C(C)Oc1cc(cc(c1)-c1ncc(C)s1)C(=O)N[C@H](C)c1ccc(nn1)C(F)(F)F
: