Target
P2X purinoceptor 2
Ligand
BDBM320075
Substrate
Meas. Tech.
Intracellular Calcium Measurement to Assess Antagonist Activity at Human P2X3 and Human P2X2/3 Receptors
IC50
22.0±n/a nM
Citation
 Davenport, AJBräuer, NFischer, OMRotgeri, ARottmann, ANeagoe, INagel, JGodinho-Coelho, AKlar, J 1,3-thiazol-2-yl substituted benzamides US Patent  US10183937 Publication Date 1/22/2019 
Target
Name:
P2X purinoceptor 2
Synonyms:
ATP receptor P2RX2_HUMAN Purinergic receptor | PurinergicP2X2/3
Type:
Enzyme Catalytic Domain
Mol. Mass.:
51765.18
Organism:
Homo sapiens (Human)
Description:
PurinergicP2X2/3 0 HUMAN::Q9UBL9
Residue:
471
  
Inhibitor
Name:
BDBM320075
Synonyms:
3-(5-ethyl-1,3- thiazol-2-yl)-5- [(3R)- tetrahydrofuran-3- yloxy]-N-{(1R)-1- [2- (trifluoromethyl) pyrimidin-5- yl]ethyl}benzamide US10202369, Example 242 | US10472354, Example 242
Type:
Small organic molecule
Emp. Form.:
C23H23F3N4O3S
Mol. Mass.:
492.514
SMILES:
CCc1cnc(s1)-c1cc(O[C@@H]2CCOC2)cc(c1)C(=O)N[C@H](C)c1cnc(nc1)C(F)(F)F
: