Target
P2X purinoceptor 2
Ligand
BDBM322574
Substrate
Meas. Tech.
Intracellular Calcium Measurement to Assess Antagonist Activity at Human P2X3 and Human P2X2/3 Receptors
IC50
28.0±n/a nM
Citation
 Davenport, AJBräuer, NFischer, OMRotgeri, ARottmann, ANeagoe, INagel, JGodinho-Coelho, AKlar, J 1,3-thiazol-2-yl substituted benzamides US Patent  US10183937 Publication Date 1/22/2019 
Target
Name:
P2X purinoceptor 2
Synonyms:
ATP receptor P2RX2_HUMAN Purinergic receptor | PurinergicP2X2/3
Type:
Enzyme Catalytic Domain
Mol. Mass.:
51765.18
Organism:
Homo sapiens (Human)
Description:
PurinergicP2X2/3 0 HUMAN::Q9UBL9
Residue:
471
  
Inhibitor
Name:
BDBM322574
Synonyms:
US10183937, Example 385 | US10202369, Example 385
Type:
Small organic molecule
Emp. Form.:
C25H26F5N5O2S
Mol. Mass.:
555.563
SMILES:
C[C@H](NC(=O)c1cc(OCC2CN(C)CCC2(F)F)cc(c1)-c1ncc(C)s1)c1cnc(nc1)C(F)(F)F
: