Target
P2X purinoceptor 3
Ligand
BDBM320240
Substrate
Meas. Tech.
Intracellular Calcium Measurement to Assess Antagonist Activity at Human P2X3 and Human P2X2/3 Receptors
IC50
15.0±n/a nM
Citation
 Davenport, AJBräuer, NFischer, OMRotgeri, ARottmann, ANeagoe, INagel, JGodinho-Coelho, AKlar, J 1,3-thiazol-2-yl substituted benzamides US Patent  US10183937 Publication Date 1/22/2019 
Target
Name:
P2X purinoceptor 3
Synonyms:
ATP receptor P2RX3 P2X purinoceptor 3 P2X purinoceptor 3 (P2X3) P2X3 purinoceptor p2x3 + hsa
Type:
Protein
Mol. Mass.:
44292.02
Organism:
Homo sapiens (Human)
Description:
P56373
Residue:
397
  
Inhibitor
Name:
BDBM320240
Synonyms:
3-(5-Methyl-1,3-thiazol-2-yl)-5-[2-oxa-5-azabicyclo[2.2.1]hept-1-ylmethoxy]-N-{(1R)-1-[2-(trifluoromethyl)pyrimidin-5-yl]ethyl}benzamide, as a Mixture of 2 Diastereoisomers US10202369, Example 407 | US10472354, Example 407
Type:
Small organic molecule
Emp. Form.:
C24H24F3N5O3S
Mol. Mass.:
519.539
SMILES:
C[C@@H](NC(=O)c1cc(OCC23CNC(CO2)C3)cc(c1)-c1ncc(C)s1)c1cnc(nc1)C(F)(F)F
: