Target
Neuronal acetylcholine receptor subunit alpha-7
Ligand
BDBM322380
Substrate
Meas. Tech.
Human alpha7 nAChR Binding Assay
Ki
155±n/a nM
Citation
 Acharya, RBurnett, DABursavich, MGCook, ASHarrison, BAKoenig, GMcriner, AJ Geminal substituted quinuclidine amide compounds as agonists of α-7 nicotonic acetylcholine receptors US Patent  US10183938 Publication Date 1/22/2019 
Target
Name:
Neuronal acetylcholine receptor subunit alpha-7
Synonyms:
ACHA7_HUMAN Cholinergic, Nicotinic Alpha7 Neuronal acetylcholine receptor protein alpha-7 subunit Nicotinic acetylcholine receptor alpha-7 (alpha7 nAChR)
Type:
Mol. Mass.:
56448.33
Organism:
Homo sapiens (Human)
Description:
CHRNA7 (NACHRA7)
Residue:
502
  
Inhibitor
Name:
BDBM322380
Synonyms:
(R)-N-(2,2-dimethylquinuclidin-3-yl)-7-(methoxymethyl)benzo[b]thiophene-2-carboxamide | US10183938, Compound (R)-143
Type:
Small organic molecule
Emp. Form.:
C20H26N2O2S
Mol. Mass.:
358.498
SMILES:
COCc1cccc2cc(sc12)C(=O)N[C@@H]1C2CCN(CC2)C1(C)C
: