Target
Serine/threonine-protein kinase B-raf [416-766,V600E]
Ligand
BDBM322525
Substrate
Meas. Tech.
LanthaScreen Eu kinase binding assay
IC50
<4±n/a nM
Citation
 Bingham, MTestar, RGignoux, C Fused bicyclic (hetero)aromatic compounds useful for the treatment of cancers US Patent  US10183939 Publication Date 1/22/2019 
Target
Name:
Serine/threonine-protein kinase B-raf [416-766,V600E]
Synonyms:
B-Raf (V600E) BRAF1 RAFB1
Type:
Mol. Mass.:
39690.71
Organism:
Homo sapiens (Human)
Description:
PV3849, from Invitrogen
Residue:
351
  
Inhibitor
Name:
BDBM322525
Synonyms:
5-[3[4-(4-pyridyl)-1H-imidazol-2-yl]chroman-6-yl]oxy-3,4-dihydro-1H-1,8-naphthyridin-2-one USRE49361, Example 4
Type:
Small organic molecule
Emp. Form.:
C25H21N5O3
Mol. Mass.:
439.4659
SMILES:
O=C1CCc2c(Oc3ccc4OCC(Cc4c3)c3nc(c[nH]3)-c3ccncc3)ccnc2N1
: