Target
RAF proto-oncogene serine/threonine-protein kinase [Y340D,Y341D]
Ligand
BDBM322547
Substrate
IC50
52±n/a nM
Citation
 Bingham, MTestar, RGignoux, C Fused bicyclic (hetero)aromatic compounds useful for the treatment of cancers US Patent  US10183939 Publication Date 1/22/2019 
Target
Name:
RAF proto-oncogene serine/threonine-protein kinase [Y340D,Y341D]
Synonyms:
C-RAF (Y340D Y341D) RAF proto-oncogene serine/threonine-protein kinase (Y340D/Y341D) RAF1 | RAF1_HUMAN
Type:
Serine/threonine-protein kinase
Mol. Mass.:
72984.33
Organism:
Homo sapiens (Human)
Description:
P04049 Y340D Y341D
Residue:
648
  
Inhibitor
Name:
BDBM322547
Synonyms:
2-Methyl-4-[3-(5-phenyl-1H-imidazol-2-yl)chroman-6-yl]oxy-pyridine USRE49361, Example 21
Type:
Small organic molecule
Emp. Form.:
C24H21N3O2
Mol. Mass.:
383.4424
SMILES:
Cc1cc(Oc2ccc3OCC(Cc3c2)c2ncc([nH]2)-c2ccccc2)ccn1
: