Target
Somatostatin receptor type 4
Ligand
BDBM322590
Substrate
Meas. Tech.
cAMP ASSAY
EC50
15.8±n/a nM
Citation
 Mazzaferro, RFerrara, MGiovannini, RLingard, I Aryl and heteroaryl-fused tetrahydro-1,4-oxazepine amides as somatostatin receptor subtype 4 (SSTR4) agonists US Patent  US10183940 Publication Date 1/22/2019 
Target
Name:
Somatostatin receptor type 4
Synonyms:
SOMATOSTATIN SST4 SS4-R SSR4_HUMAN SSTR4 | Somatostatin receptor type 4 (SSTR4)
Type:
Enzyme
Mol. Mass.:
42015.38
Organism:
Homo sapiens (Human)
Description:
P31391
Residue:
388
  
Inhibitor
Name:
BDBM322590
Synonyms:
US10183940, Example 42
Type:
Small organic molecule
Emp. Form.:
C21H25N5O2
Mol. Mass.:
379.4555
SMILES:
Cc1cccc2c(nn(C)c12)C(C)(C)NC(=O)c1cncc2CNCCOc12
: