Target
Somatostatin receptor type 4
Ligand
BDBM322594
Substrate
Meas. Tech.
cAMP ASSAY
EC50
9.20±n/a nM
Citation
 Mazzaferro, RFerrara, MGiovannini, RLingard, I Aryl and heteroaryl-fused tetrahydro-1,4-oxazepine amides as somatostatin receptor subtype 4 (SSTR4) agonists US Patent  US10183940 Publication Date 1/22/2019 
Target
Name:
Somatostatin receptor type 4
Synonyms:
SOMATOSTATIN SST4 SS4-R SSR4_HUMAN SSTR4 | Somatostatin receptor type 4 (SSTR4)
Type:
Enzyme
Mol. Mass.:
42015.38
Organism:
Homo sapiens (Human)
Description:
P31391
Residue:
388
  
Inhibitor
Name:
BDBM322594
Synonyms:
US10183940, Example 46
Type:
Small organic molecule
Emp. Form.:
C21H22N4O2
Mol. Mass.:
362.425
SMILES:
CC(C)(NC(=O)c1cccc2CNCCOc12)c1ncnc2ccccc12
: