Target
Somatostatin receptor type 4
Ligand
BDBM322600
Substrate
Meas. Tech.
cAMP ASSAY
EC50
8.70±n/a nM
Citation
 Mazzaferro, RFerrara, MGiovannini, RLingard, I Aryl and heteroaryl-fused tetrahydro-1,4-oxazepine amides as somatostatin receptor subtype 4 (SSTR4) agonists US Patent  US10183940 Publication Date 1/22/2019 
Target
Name:
Somatostatin receptor type 4
Synonyms:
SOMATOSTATIN SST4 SS4-R SSR4_HUMAN SSTR4 | Somatostatin receptor type 4 (SSTR4)
Type:
Enzyme
Mol. Mass.:
42015.38
Organism:
Homo sapiens (Human)
Description:
P31391
Residue:
388
  
Inhibitor
Name:
BDBM322600
Synonyms:
US10183940, Example 52
Type:
Small organic molecule
Emp. Form.:
C21H23FN4O2
Mol. Mass.:
382.4313
SMILES:
Cc1cc(F)cn2c(ncc12)C(C)(C)NC(=O)c1cccc2CNCCOc12
: