Target
Somatostatin receptor type 1
Ligand
BDBM322573
Substrate
Meas. Tech.
Radioligand Binding Assays
Ki
9450±n/a nM
Citation
 Mazzaferro, RFerrara, MGiovannini, RLingard, I Aryl and heteroaryl-fused tetrahydro-1,4-oxazepine amides as somatostatin receptor subtype 4 (SSTR4) agonists US Patent  US10183940 Publication Date 1/22/2019 
Target
Name:
Somatostatin receptor type 1
Synonyms:
SOMATOSTATIN SST1 SS-1-R SS1R SSTR1 | Somatostatin receptor type 1 (SSTR1)
Type:
Enzyme
Mol. Mass.:
42692.81
Organism:
Homo sapiens (Human)
Description:
P30872
Residue:
391
  
Inhibitor
Name:
BDBM322573
Synonyms:
US10183940, Example 26
Type:
Small organic molecule
Emp. Form.:
C22H24N4O2
Mol. Mass.:
376.4516
SMILES:
Cc1nnc(c2ccccc12)C(C)(C)NC(=O)c1cccc2CNCCOc12
: