Target
Non-receptor tyrosine-protein kinase TYK2
Ligand
BDBM292119
Substrate
Ki
0.55±n/a nM
Citation
 Benjamin, NDabros, MThalladi, VR JAK kinase inhibitor compounds for treatment of respiratory disease US Patent  US10183942 Publication Date 1/22/2019 
Target
Name:
Non-receptor tyrosine-protein kinase TYK2
Synonyms:
Non-receptor tyrosine-protein kinase TYK2 (TYK2) TYK2_HUMAN | Tyrosine-protein kinase TYK2
Type:
Protein
Mol. Mass.:
133666.03
Organism:
Homo sapiens (Human)
Description:
P29597
Residue:
1187
  
Inhibitor
Name:
BDBM292119
Synonyms:
US10100049, Example 16 US10183942, Example 16 US10913740, Example 16 US11718616, Example 16
Type:
Small organic molecule
Emp. Form.:
C27H31FN6O
Mol. Mass.:
474.573
SMILES:
CCc1cc(O)c(F)cc1-c1ccc2c(n[nH]c2c1)-c1nc2CN(CCN3CCCC3)CCc2[nH]1
: