Target
Tyrosine-protein kinase SYK
Ligand
BDBM322744
Substrate
Meas. Tech.
Inhibition of Enzymatic Syk Kinase Activity
IC50
<10±n/a nM
Citation
 Venkatesan, ASmith, RASubramanya, HPotluri, VPanigrahi, SKBasetti, VKunta, K Pyrimido-pyridazinone compounds and methods of use thereof US Patent  US10183944 Publication Date 1/22/2019 
Target
Name:
Tyrosine-protein kinase SYK
Synonyms:
KSYK_HUMAN Spleen Tyrosine Kinase Tyrosine-protein kinase SYK (Syk)
Type:
Enzyme
Mol. Mass.:
72079.99
Organism:
Homo sapiens (Human)
Description:
P43405
Residue:
635
  
Inhibitor
Name:
BDBM322744
Synonyms:
2-(1-(5-((2-(4-(cyanomethyl)piperidin-1- yl)-5-oxo-5,6-dihydropyrimido[4,5- d]pyridazin-4-yl)amino)pyridin-2-yl) piperidin-4-yl)acetonitrile | US10183944, Example 114
Type:
Small organic molecule
Emp. Form.:
C25H28N10O
Mol. Mass.:
484.5562
SMILES:
O=c1[nH]ncc2nc(nc(Nc3ccc(nc3)N3CCC(C[N+]#[C-])CC3)c12)N1CCC(CC#N)CC1
: