Target
Tyrosine-protein kinase SYK
Ligand
BDBM322805
Substrate
Meas. Tech.
Inhibition of Enzymatic Syk Kinase Activity
IC50
<10±n/a nM
Citation
 Venkatesan, ASmith, RASubramanya, HPotluri, VPanigrahi, SKBasetti, VKunta, K Pyrimido-pyridazinone compounds and methods of use thereof US Patent  US10183944 Publication Date 1/22/2019 
Target
Name:
Tyrosine-protein kinase SYK
Synonyms:
KSYK_HUMAN Spleen Tyrosine Kinase Tyrosine-protein kinase SYK (Syk)
Type:
Enzyme
Mol. Mass.:
72079.99
Organism:
Homo sapiens (Human)
Description:
P43405
Residue:
635
  
Inhibitor
Name:
BDBM322805
Synonyms:
2-(azepan-1-yl)-4-((4-(4-ethyl-3- oxopiperazin-1-yl)phenyl)amino) pyrimido[4,5-d]pyridazin-5(6H)-one US10647720, Ex. # 175
Type:
Small organic molecule
Emp. Form.:
C24H30N8O2
Mol. Mass.:
462.5474
SMILES:
CCN1CCN(CC1=O)c1ccc(Nc2nc(nc3cn[nH]c(=O)c23)N2CCCCCC2)cc1
: