Target
Tyrosine-protein kinase SYK
Ligand
BDBM322839
Substrate
Meas. Tech.
Inhibition of Enzymatic Syk Kinase Activity
IC50
<10±n/a nM
Citation
 Venkatesan, ASmith, RASubramanya, HPotluri, VPanigrahi, SKBasetti, VKunta, K Pyrimido-pyridazinone compounds and methods of use thereof US Patent  US10183944 Publication Date 1/22/2019 
Target
Name:
Tyrosine-protein kinase SYK
Synonyms:
KSYK_HUMAN Spleen Tyrosine Kinase Tyrosine-protein kinase SYK (Syk)
Type:
Enzyme
Mol. Mass.:
72079.99
Organism:
Homo sapiens (Human)
Description:
P43405
Residue:
635
  
Inhibitor
Name:
BDBM322839
Synonyms:
2-(azepan-1-yl)-4-((4-(2-(4- ethylpiperazin-1-yl)ethyl)phenyl)amino) pyrimido[4,5-d]pyridazin-5(6H)-one US10647720, Ex. # 209
Type:
Small organic molecule
Emp. Form.:
C26H38N8O
Mol. Mass.:
478.6329
SMILES:
CCN1CCN(CCc2ccc(Nc3nc(nc(C=N)c3C(N)=O)N3CCCCCC3)cc2)CC1
: