Target
Tyrosine-protein kinase JAK2
Ligand
BDBM322845
Substrate
Meas. Tech.
Inhibition of Enzymatic JAK2 Kinase Activity
IC50
<10±n/a nM
Citation
 Venkatesan, ASmith, RASubramanya, HPotluri, VPanigrahi, SKBasetti, VKunta, K Pyrimido-pyridazinone compounds and methods of use thereof US Patent  US10183944 Publication Date 1/22/2019 
Target
Name:
Tyrosine-protein kinase JAK2
Synonyms:
JAK-2 JAK2_HUMAN Janus kinase 2 (JAK2) | Janus kinase 2 (a protein tyrosine kinase)
Type:
Protein
Mol. Mass.:
130684.68
Organism:
Homo sapiens (Human)
Description:
O60674
Residue:
1132
  
Inhibitor
Name:
BDBM322845
Synonyms:
3-(4-(4-((2-(azepan-1-yl)-5-oxo-5,6- dihydropyrimido[4,5-d]pyridazin-4-yl) amino)phenyl)piperazin-1-yl)-3- oxopropanenitrile US10647720, Ex. # 215
Type:
Small organic molecule
Emp. Form.:
C25H31N9O2
Mol. Mass.:
489.5727
SMILES:
NC(=O)c1c(Nc2ccc(cc2)N2CCN(CC2)C(=O)CC#N)nc(nc1C=N)N1CCCCCC1
: