Target
Tyrosine-protein kinase SYK
Ligand
BDBM322853
Substrate
Meas. Tech.
Inhibition of Enzymatic Syk Kinase Activity
IC50
<10±n/a nM
Citation
 Venkatesan, ASmith, RASubramanya, HPotluri, VPanigrahi, SKBasetti, VKunta, K Pyrimido-pyridazinone compounds and methods of use thereof US Patent  US10183944 Publication Date 1/22/2019 
Target
Name:
Tyrosine-protein kinase SYK
Synonyms:
KSYK_HUMAN Spleen Tyrosine Kinase Tyrosine-protein kinase SYK (Syk)
Type:
Enzyme
Mol. Mass.:
72079.99
Organism:
Homo sapiens (Human)
Description:
P43405
Residue:
635
  
Inhibitor
Name:
BDBM322853
Synonyms:
2-(1-(4-((4-(4-(2-hydroxy-2- methylpropanoyl)piperazin-1-yl)phenyl) amino)-5-oxo-5,6-dihydropyrimido[4,5- d]pyridazin-2-yl)piperidin-4-yl) acetonitrile US10647720, Ex. # 223
Type:
Small organic molecule
Emp. Form.:
C27H35N9O3
Mol. Mass.:
533.6253
SMILES:
CC(C)(O)C(=O)N1CCN(CC1)c1ccc(Nc2nc(nc(C=N)c2C(N)=O)N2CCC(CC#N)CC2)cc1
: