Target
Tyrosine-protein kinase JAK2
Ligand
BDBM322862
Substrate
Meas. Tech.
Inhibition of Enzymatic JAK2 Kinase Activity
IC50
<10±n/a nM
Citation
 Venkatesan, ASmith, RASubramanya, HPotluri, VPanigrahi, SKBasetti, VKunta, K Pyrimido-pyridazinone compounds and methods of use thereof US Patent  US10183944 Publication Date 1/22/2019 
Target
Name:
Tyrosine-protein kinase JAK2
Synonyms:
JAK-2 JAK2_HUMAN Janus kinase 2 (JAK2) | Janus kinase 2 (a protein tyrosine kinase)
Type:
Protein
Mol. Mass.:
130684.68
Organism:
Homo sapiens (Human)
Description:
O60674
Residue:
1132
  
Inhibitor
Name:
BDBM322862
Synonyms:
2-(1-(4-((2-(azepan-1-yl)-5-oxo-5,6- dihydropyrimido[4,5-d]pyridazin-4-yl) amino)phenyl)piperidin-3-yl)acetic acid US10183944, Example 233 | US10647720, Ex. # 233
Type:
Small organic molecule
Emp. Form.:
C25H33N7O3
Mol. Mass.:
479.5746
SMILES:
NC(=O)c1c(Nc2ccc(cc2)N2CCCC(CC(O)=O)C2)nc(nc1C=N)N1CCCCCC1
: