Target
Tyrosine-protein kinase JAK2
Ligand
BDBM322934
Substrate
Meas. Tech.
Inhibition of Enzymatic JAK2 Kinase Activity
IC50
<10±n/a nM
Citation
 Venkatesan, ASmith, RASubramanya, HPotluri, VPanigrahi, SKBasetti, VKunta, K Pyrimido-pyridazinone compounds and methods of use thereof US Patent  US10183944 Publication Date 1/22/2019 
Target
Name:
Tyrosine-protein kinase JAK2
Synonyms:
JAK-2 JAK2_HUMAN Janus kinase 2 (JAK2) | Janus kinase 2 (a protein tyrosine kinase)
Type:
Protein
Mol. Mass.:
130684.68
Organism:
Homo sapiens (Human)
Description:
O60674
Residue:
1132
  
Inhibitor
Name:
BDBM322934
Synonyms:
3-(4-((2-(azepan-1-yl)-5-oxo-5,6- dihydropyrimido[4,5-d]pyridazin-4- yl)amino)phenyl)propanoic acid US10647720, Ex. # 304
Type:
Small organic molecule
Emp. Form.:
C21H24N6O3
Mol. Mass.:
408.4537
SMILES:
OC(=O)CCc1ccc(Nc2nc(nc3cn[nH]c(=O)c23)N2CCCCCC2)cc1
: