Target
Cannabinoid receptor 1
Ligand
BDBM322974
Substrate
Meas. Tech.
cAMP Assay
EC50
>10000±n/a nM
Citation
 Grether, UNettekoven, MRogers-Evans, MSchmitt, SStenton, BJ Triazolo[4,5-D]pyrimidines US Patent  US10183946 Publication Date 1/22/2019 
Target
Name:
Cannabinoid receptor 1
Synonyms:
CANN6 CB-R CNR CNR1_HUMAN Cannabinoid receptor Cannabinoid receptor 1 (brain)
Type:
G Protein-Coupled Receptor (GPCR)
Mol. Mass.:
52868.96
Organism:
Homo sapiens (Human)
Description:
P21554
Residue:
472
  
Inhibitor
Name:
BDBM322974
Synonyms:
5-tert-butyl-7-(4-chloro-2-fluorophenyl)-3-[(2-chlorophenyl)methyl]triazolo[4,5-d]pyrimidine | US10183946, Example 5
Type:
Small organic molecule
Emp. Form.:
C21H18Cl2FN5
Mol. Mass.:
430.306
SMILES:
CC(C)(C)c1nc(-c2ccc(Cl)cc2F)c2nnn(Cc3ccccc3Cl)c2n1
: