Target
Cannabinoid receptor 2
Ligand
BDBM322985
Substrate
Meas. Tech.
cAMP Assay
EC50
42.4±n/a nM
Citation
 Grether, UNettekoven, MRogers-Evans, MSchmitt, SStenton, BJ Triazolo[4,5-D]pyrimidines US Patent  US10183946 Publication Date 1/22/2019 
Target
Name:
Cannabinoid receptor 2
Synonyms:
CANNABINOID CB2 CB2 CB2B CNR2_HUMAN Cannabinoid CB2 receptor Cannabinoid receptor 2 (CB2R) | hCB2
Type:
G Protein-Coupled Receptor (GPCR)
Mol. Mass.:
39690.94
Organism:
Homo sapiens (Human)
Description:
P34972
Residue:
360
  
Inhibitor
Name:
BDBM322985
Synonyms:
1-[5-tert-butyl-7-(2-methylpyrazol-3-yl)triazolo[4,5-d]pyrimidin-3-yl]-4,4,4-trifluorobutan-2-ol | US10183946, Example 16
Type:
Small organic molecule
Emp. Form.:
C16H20F3N7O
Mol. Mass.:
383.3715
SMILES:
Cn1nccc1-c1nc(nc2n(CC(O)CC(F)(F)F)nnc12)C(C)(C)C
: