Target
Cannabinoid receptor 1
Ligand
BDBM322992
Substrate
Meas. Tech.
cAMP Assay
EC50
>10000±n/a nM
Citation
 Grether, UNettekoven, MRogers-Evans, MSchmitt, SStenton, BJ Triazolo[4,5-D]pyrimidines US Patent  US10183946 Publication Date 1/22/2019 
Target
Name:
Cannabinoid receptor 1
Synonyms:
CANN6 CB-R CNR CNR1_HUMAN Cannabinoid receptor Cannabinoid receptor 1 (brain)
Type:
G Protein-Coupled Receptor (GPCR)
Mol. Mass.:
52868.96
Organism:
Homo sapiens (Human)
Description:
P21554
Residue:
472
  
Inhibitor
Name:
BDBM322992
Synonyms:
5-tert-butyl-3-[(3-methyloxetan-3-yl)methyl]-7-(2-methylpyrazol-3-yl)triazolo[4,5-d]pyrimidine | US10183946, Example 23
Type:
Small organic molecule
Emp. Form.:
C17H23N7O
Mol. Mass.:
341.4108
SMILES:
Cn1nccc1-c1nc(nc2n(CC3(C)COC3)nnc12)C(C)(C)C
: