Target
Cannabinoid receptor 1
Ligand
BDBM322997
Substrate
Meas. Tech.
cAMP Assay
EC50
>10000±n/a nM
Citation
 Grether, UNettekoven, MRogers-Evans, MSchmitt, SStenton, BJ Triazolo[4,5-D]pyrimidines US Patent  US10183946 Publication Date 1/22/2019 
Target
Name:
Cannabinoid receptor 1
Synonyms:
CANN6 CB-R CNR CNR1_HUMAN Cannabinoid receptor Cannabinoid receptor 1 (brain)
Type:
G Protein-Coupled Receptor (GPCR)
Mol. Mass.:
52868.96
Organism:
Homo sapiens (Human)
Description:
P21554
Residue:
472
  
Inhibitor
Name:
BDBM322997
Synonyms:
5-tert-butyl-7-(1H-imidazol-2-yl)-3-[(1-methyltetrazol-5-yl)methyl]triazolo[4,5-d]pyrimidine | US10183946, Example 28
Type:
Small organic molecule
Emp. Form.:
C14H17N11
Mol. Mass.:
339.3585
SMILES:
Cn1nnnc1Cn1nnc2c(nc(nc12)C(C)(C)C)-c1ncc[nH]1
: