Target
Cannabinoid receptor 1
Ligand
BDBM323010
Substrate
Meas. Tech.
cAMP Assay
EC50
>10000±n/a nM
Citation
 Grether, UNettekoven, MRogers-Evans, MSchmitt, SStenton, BJ Triazolo[4,5-D]pyrimidines US Patent  US10183946 Publication Date 1/22/2019 
Target
Name:
Cannabinoid receptor 1
Synonyms:
CANN6 CB-R CNR CNR1_HUMAN Cannabinoid receptor Cannabinoid receptor 1 (brain)
Type:
G Protein-Coupled Receptor (GPCR)
Mol. Mass.:
52868.96
Organism:
Homo sapiens (Human)
Description:
P21554
Residue:
472
  
Inhibitor
Name:
BDBM323010
Synonyms:
Cis-1-[5-tert-Butyl-3-[(2-chlorophenyl)methyl]triazolo[4,5-d]pyrimidin-7-yl]-3-(difluoromethyl)cyclobutanol | US10183946, Example 41
Type:
Small organic molecule
Emp. Form.:
C20H22ClF2N5O
Mol. Mass.:
421.871
SMILES:
CC(C)(C)c1nc(c2nnn(Cc3ccccc3Cl)c2n1)[C@@]1(O)C[C@@H](C1)C(F)F
: