Target
Arachidonate 5-lipoxygenase-activating protein
Ligand
BDBM323017
Substrate
Meas. Tech.
FLAP Binding Assay (Test A)
IC50
34.0±n/a nM
Citation
 Broddefalk, JOEmtenäs, HFGranberg, KLLemurell, MAPettersen, DTPlowright, ATUlander, LJ Pyrazole derivatives useful as 5-lipoxygenase activating protein (FLAP) inhibitors US Patent  US10183947 Publication Date 1/22/2019 
Target
Name:
Arachidonate 5-lipoxygenase-activating protein
Synonyms:
5-lipoxygenase activating protein 5-lipoxygenase/FLAP ALOX5AP MK-886-binding protein
Type:
Enzyme
Mol. Mass.:
18159.90
Organism:
Homo sapiens (Human)
Description:
P20292
Residue:
161
  
Inhibitor
Name:
BDBM323017
Synonyms:
1-Methyl-4-[({(1R,2R)-2-[4-(1H-pyrazol- 3-yl)benzoyl]cyclohexyl}carbonyl)amino]- 1H-pyrazole-5-carboxamide US10508119, Example 2 US11691978, Example 2
Type:
Small organic molecule
Emp. Form.:
C22H24N6O3
Mol. Mass.:
420.4644
SMILES:
Cn1ncc(NC(=O)[C@@H]2CCCC[C@H]2C(=O)c2ccc(cc2)-c2cc[nH]n2)c1C(N)=O
: