Target
Arachidonate 5-lipoxygenase-activating protein
Ligand
BDBM323025
Substrate
Meas. Tech.
FLAP Binding Assay (Test A)
IC50
30.0±n/a nM
Citation
 Broddefalk, JOEmtenäs, HFGranberg, KLLemurell, MAPettersen, DTPlowright, ATUlander, LJ Pyrazole derivatives useful as 5-lipoxygenase activating protein (FLAP) inhibitors US Patent  US10183947 Publication Date 1/22/2019 
Target
Name:
Arachidonate 5-lipoxygenase-activating protein
Synonyms:
5-lipoxygenase activating protein 5-lipoxygenase/FLAP ALOX5AP MK-886-binding protein
Type:
Enzyme
Mol. Mass.:
18159.90
Organism:
Homo sapiens (Human)
Description:
P20292
Residue:
161
  
Inhibitor
Name:
BDBM323025
Synonyms:
(1R,2R)-N-[3-(Difluoromethoxy)-1- methyl-1H-pyrazol-4-yl]-2-[4-(1H-pyrazol- 5-yl)benzoyl]cyclohexanecarboxamide US10508119, Example 9 | US11001589, Example 9
Type:
Small organic molecule
Emp. Form.:
C22H23F2N5O3
Mol. Mass.:
443.4465
SMILES:
Cn1cc(NC(=O)[C@@H]2CCCC[C@H]2C(=O)c2ccc(cc2)-c2ccn[nH]2)c(OC(F)F)n1
: