Target
Arachidonate 5-lipoxygenase-activating protein
Ligand
BDBM323055
Substrate
Meas. Tech.
FLAP Binding Assay (Test A)
IC50
20.0±n/a nM
Citation
 Broddefalk, JOEmtenäs, HFGranberg, KLLemurell, MAPettersen, DTPlowright, ATUlander, LJ Pyrazole derivatives useful as 5-lipoxygenase activating protein (FLAP) inhibitors US Patent  US10183947 Publication Date 1/22/2019 
Target
Name:
Arachidonate 5-lipoxygenase-activating protein
Synonyms:
5-lipoxygenase activating protein 5-lipoxygenase/FLAP ALOX5AP MK-886-binding protein
Type:
Enzyme
Mol. Mass.:
18159.90
Organism:
Homo sapiens (Human)
Description:
P20292
Residue:
161
  
Inhibitor
Name:
BDBM323055
Synonyms:
4-[({(1R,2R or 1S,2S)-2-[2-Fluoro-4-(3- methyl-1H-pyrazol-5-yl)benzoyl] cyclohexyl}carbonyl)amino]-1H-pyrazole- 5-carboxamide US10508119, Example 38
Type:
Small organic molecule
Emp. Form.:
C22H23FN6O3
Mol. Mass.:
438.4548
SMILES:
Cc1cc([nH]n1)-c1ccc(C(=O)C2CCCCC2C(=O)Nc2cn[nH]c2C(N)=O)c(F)c1
: